{"text_format":"1","workbook":"xlsx","n_sheets":17,"sheets":["OMVN-1","INFORME DE COMISIÓN","OMVE-1","GRC","INFORME GASTOS REPRESENTACIÓN","Informe de servicios oficiales","OFICIO DE COMISIÓN","CONFIRMACIÓN DE LA COMISIÓN","LISTAS DE ASISTENCIA","AUTORIZACIÓN PASAJES AÉREOS","SOLICITUD DE PAGO","PT OFICINAS CENTRALES","PT FORMADORAS","GO OF CENTRALES","GO FORMADORAS","Hoja3","Hoja2"],"not_rendered":{"charts":0,"images":3,"macros":1,"external_links":0,"defined_names":0,"comments":2,"pivot_tables":0},"unopened":[],"bounds":{"document_bytes":16777216,"sheet_cells":100000,"rows_first":2000,"rows_last":500,"rows_between":2000,"halvings":0,"cell_chars":16384,"cell_head_chars":4096},"cells_cut":0,"cells_raw":0,"read":"whole","date_system":"1900"}

{"sheet":"OMVN-1","index":0,"n_rows":60,"n_cols":14,"rows_kept":60,"cut":false,"hidden":false,"merged":[[36,2,36,13],[16,3,16,13],[18,5,18,13],[25,2,25,13],[27,3,27,13],[22,6,22,10],[23,6,23,10],[35,2,35,13],[32,5,32,13],[31,5,31,13],[29,4,29,5],[29,7,29,9],[8,2,8,13],[10,3,10,13],[12,3,12,13],[4,1,4,14],[3,2,3,14],[2,5,2,12],[55,2,55,6],[55,8,55,12],[56,8,56,12],[59,9,59,10],[59,2,59,5],[56,2,56,6],[33,5,33,13],[34,2,34,13],[41,6,41,8],[41,9,41,10],[41,2,41,4],[37,2,37,13],[39,2,40,4],[39,5,39,8],[39,9,40,10],[39,11,40,11],[39,12,40,13],[40,6,40,8],[45,6,45,8],[48,5,48,12],[45,12,45,13],[46,12,46,13],[41,12,41,13],[42,12,42,13],[42,9,42,10],[43,9,43,10],[43,12,43,13],[44,9,44,10],[44,12,44,13],[45,9,45,10],[42,2,42,4],[42,6,42,8],[45,2,45,4],[43,2,43,4],[44,2,44,4],[43,6,43,8],[44,6,44,8]]}
[]
[]
[null,null,null,null,null,"ORDEN DE MINISTRACIÓN DE VIÁTICOS"]
[]
[null,"                    FORMATO OMVN-1"]
[]
[]
[null,null,null,null,null,null,null,null,null,null,"Folio:"]
[null,null,"1                                                           DATOS DEL COMISIONADO"]
[]
[null,null,"Nombre:","Nombre del comisionado"]
[]
[null,null,"Cargo:","Cargo del comisionado"]
[]
[null,null,"Clave Presupuestaria:",null,null,null,"09","UR","A. FUNC","PROG","PART","FONDO"]
[]
[null,null,"R.F.C.:","RFC del comisionado"]
[]
[null,null,"Lugar de Adscripción:",null,null,"Silao de la Victoria, Guanajuato"]
[]
{"$rows_left_out":41}
{"sheet":"INFORME DE COMISIÓN","index":1,"n_rows":18,"n_cols":12,"rows_kept":18,"cut":false,"hidden":false,"merged":[[8,2,8,3],[15,3,15,8],[16,3,16,8],[31,3,31,8],[17,3,17,8],[9,2,9,3],[8,4,8,10],[9,6,9,9],[2,2,2,11],[7,2,7,3],[7,4,7,10],[5,4,5,10],[6,4,6,10],[5,2,5,3],[6,2,6,3]]}
[]
[]
[null,null,"Informe del Encargo o Comisión "]
[null,null,null,null,"Silao de la victoria",",Gto., a los",12,"días del mes de ","julio","del año",2019,"."]
[]
[null,null,"Nombre:",null,"Nombre del comisionado"]
[null,null,"Fecha (s):",null,"Fecha de la comisión"]
[null,null,"Destino:",null,"Destino de la Comisión"]
[null,null,"Motivo:",null,"Motivo de la comisión"]
[null,null,"Monto erogado:",null,null,"(",{"$f":"NUM_TEXTO(E10)","v":"PESOS   /100 M.N."},null,null,null,")"]
[]
[]
[]
[]
[]
[]
[null,null,null,"FIRMA"]
[null,null,null,{"$f":"E6","v":"Nombre del comisionado"}]

{"sheet":"OMVE-1","index":2,"n_rows":63,"n_cols":15,"rows_kept":63,"cut":false,"hidden":false,"merged":[[56,9,56,13],[56,2,56,6],[30,11,30,13],[44,2,44,3],[43,2,43,3],[32,5,32,14],[45,4,45,6],[46,4,46,6],[47,4,47,6],[48,4,48,6],[38,5,38,14],[41,5,41,13],[40,5,40,7],[26,2,26,14],[28,3,28,14],[23,6,23,10],[30,4,30,5],[55,2,55,6],[55,9,55,13],[62,2,62,5],[62,9,62,11],[30,7,30,9],[2,1,2,16],[3,1,3,16],[44,4,44,6],[43,4,43,6],[34,5,34,14],[36,5,36,14],[58,1,58,16],[59,1,59,16],[45,2,45,3],[51,5,51,12],[46,2,46,3],[47,2,47,3],[24,6,24,10],[1,1,1,16],[7,2,7,3],[8,2,8,14],[18,5,18,14],[16,3,16,14],[12,3,12,14],[10,3,10,14],[14,10,14,11]]}
[]
[null,"                                                ORDEN DE MINISTRACIÓN DE VIATICOS EN EL EXTRANJERO"]
[]
[null,"                             FORMATO OMVE-1"]
[]
[]
[]
[null,null,"Folio:"]
[null,null,"1                                                           DATOS DEL COMISIONADO"]
[]
[null,null,"Nombre:","Nombre del comisionado"]
[]
[null,null,"Cargo:","Cargo del comisionado"]
[]
[null,null,"Clave Presupuestaria:",null,null,null,"09","0916","A.FUNC.","PROG","FONDO"]
[]
[null,null,"R.F.C.:","RFC DEL COMISIONADO"]
[]
[null,null,"Lugar de Adscripción:",null,null,"Lugar de trabajo del comisionado"]
[]
{"$rows_left_out":44}
{"sheet":"GRC","index":3,"n_rows":55,"n_cols":18,"rows_kept":55,"cut":false,"hidden":false,"merged":[[40,7,40,10],[38,7,38,10],[38,2,38,6],[39,2,39,6],[19,4,19,16],[28,11,28,16],[29,3,29,9],[35,2,35,16],[34,2,34,16],[37,7,37,10],[37,11,37,16],[38,11,38,16],[39,11,39,16],[39,7,39,10],[41,2,41,6],[19,2,19,3],[13,2,13,4],[13,5,13,6],[17,3,17,16],[13,8,13,15],[25,3,25,16],[15,2,15,4],[15,5,15,16],[29,11,29,16],[27,3,27,16],[28,3,28,9],[23,3,23,16],[24,3,24,16],[32,6,32,12],[37,2,37,6],[45,2,45,6],[44,7,44,10],[45,11,45,16],[47,7,47,9],[47,11,47,16],[52,11,52,16],[54,1,55,17],[51,11,51,16],[41,11,41,16],[40,11,40,16],[40,2,40,6],[43,7,43,10],[43,11,43,16],[42,11,42,16],[42,2,42,6],[41,7,41,10],[44,2,44,6],[43,2,43,6],[44,11,44,16],[42,7,42,10],[45,7,45,10],[11,2,11,9],[11,11,11,16],[1,1,1,17],[2,1,2,17],[9,2,9,16],[4,1,4,17],[5,1,5,17]]}
[]
[null,"                             SECRETARIA DE INNOVACION, CIENCIA Y EDUCACION SUPERIOR"]
[null,"               UNIDAD RESPONSABLE"]
[]
[null,"         SOLICITUD DE GASTOS A \n          RESERVA DE COMPROBAR"]
[null,"             GRC-1"]
[]
[]
[]
[null,null,"1                                            DATOS GENERALES DE SOLICITUD"]
[null,null,"TITULAR DEL ÁREA DE ADMINISTRACIÓN"]
[null,null,"Solicito a usted, la autorización para que se expida cheque a favor de: ",null,null,null,null,null,null,null,null,"Nombre del solicitante"]
[]
[null,null,"Por la cantidad de:",null,null,{"$f":"H48","v":0},null,"(",{"$f":"NUM_TEXTO(F14)","v":"PESOS 00/100 M.N."},null,null,null,null,null,null,null,")"]
[]
[null,null,"Nombre del evento:"]
[]
[null,null,"Lugar:"]
[]
[null,null,"Duración:"]
{"$rows_left_out":36}
{"sheet":"INFORME GASTOS REPRESENTACIÓN","index":4,"n_rows":19,"n_cols":12,"rows_kept":19,"cut":false,"hidden":false,"merged":[[8,4,8,10],[18,3,18,8],[32,3,32,8],[16,3,16,8],[17,3,17,8],[9,6,9,9],[8,2,8,3],[9,2,9,3],[7,2,7,3],[7,4,7,10],[2,2,2,11],[5,2,5,3],[5,4,5,10],[6,2,6,3],[6,4,6,10]]}
[]
[]
[null,null,"Informe de Gastos de Representación"]
[null,null,null,null,"Silao de la Victoria",",Gto., a los",null,"días del mes de ",null,"del año",2019,"."]
[]
[null,null,"Nombre:",null,"Colocar el nombre de la persona que se designó para la representatividad"]
[null,null,"Fecha (s):",null,"Día-mes-año."]
[null,null,"Destino:",null,"Dar el nombre del lugar y la Ciudad a la que se acudió. "]
[null,null,"Motivo:",null,"Describir de forma breve y sencilla el motivo por el cual se realizó dicha actividad ej. Se acudió a las instalaciones de la SEP, con domicilio en ____, en la Ciudad de México, para abordar temas relacionados entre esta Secretaría y la Federación, etc."]
[null,null,"Monto erogado:",null,0,"(",{"$f":"NUM_TEXTO(E10)","v":"PESOS 00/100 M.N."},null,null,null,")"]
[]
[]
[]
[]
[]
[]
[]
[null,null,null,"FIRMA"]
[null,null,null,{"$f":"E6","v":"Colocar el nombre de la persona que se designó para la representatividad"}]

{"sheet":"Informe de servicios oficiales","index":5,"n_rows":29,"n_cols":4,"rows_kept":29,"cut":false,"hidden":false,"merged":[[21,1,21,2]]}
[]
[null,null,null,"FORMATO DE JUSTIFICACIÓN DE SERVICIOS OFICIALES"]
[]
[null,null,null,"ANEXO DEL OFICIO: "]
[]
[]
[]
[null,"PARTIDA (S)","IMPORTE","JUSTIFICACIÓN"]
[]
[]
[]
[]
[]
[]
[]
[]
[]
[]
[]
[]
{"$rows_left_out":10}
{"sheet":"OFICIO DE COMISIÓN","index":6,"n_rows":48,"n_cols":8,"rows_kept":48,"cut":false,"hidden":false,"merged":[[13,1,13,5],[0,0,1,7],[3,0,3,7],[9,0,9,1],[9,4,9,5],[9,6,9,7],[14,1,14,4],[35,4,35,5],[33,4,33,5],[23,0,27,7],[29,1,29,7],[35,0,35,1],[33,0,33,1],[39,0,39,1],[30,1,30,7],[53,2,53,4],[54,2,54,4],[41,3,41,5],[44,2,44,5],[47,2,48,4],[51,2,51,4],[52,2,52,4]]}
["Secretaría de Innovación, Ciencia y Educación Superior"]
[]
[]
["Oficio de Comisión"]
[]
[]
[]
[null,null,null,null,null,null,"No:"]
[]
["Silao de la Victoria, Gto.",null,null,"de",null,null,"de 2020"]
[]
[]
[]
["Suscribe el C.:"]
[]
[]
["P R E S E N T E"]
[]
[]
[]
{"$rows_left_out":29}
{"sheet":"CONFIRMACIÓN DE LA COMISIÓN","index":7,"n_rows":39,"n_cols":9,"rows_kept":39,"cut":false,"hidden":false,"merged":[[17,1,17,2],[17,3,17,9],[1,1,1,9],[11,1,11,4],[19,1,19,9],[14,1,14,9],[13,1,13,9],[11,5,11,9],[12,1,12,9],[15,4,15,6],[21,3,21,9],[31,2,31,5],[21,1,21,2],[33,2,33,5],[37,2,37,4],[37,7,37,9],[22,1,22,9],[23,1,23,9],[24,1,24,9],[25,1,25,9]]}
[]
[null,"            CONFIRMACIÓN DE LA COMISIÓN"]
[]
[null,null,null,null,null,null,null,null,"No."]
[]
[null,null,null,null,null,null,null,null,"Fecha :"]
[]
[]
[null,"P R E S E N T E "]
[]
[]
[null,"El que suscribe, hace constar que el C.",null,null,null,"Nombre del comisionado"]
[]
[]
[]
[null,"Asistió el día",4,"de",null,null,null,"de 2020"]
[]
[null,"Al centro de trabajo :"]
[]
[]
{"$rows_left_out":20}
{"sheet":"LISTAS DE ASISTENCIA","index":8,"n_rows":20,"n_cols":5,"rows_kept":20,"cut":false,"hidden":false,"merged":[[2,2,2,3],[0,0,0,4]]}
["FORMATO DE REGISTRO DE ASISTENCIA "]
[null,"Lugar y fecha:",null,"Horario:"]
[null,"Motivo: "]
[]
["No.","Área de Adscripción","Nombre","Correo Electronico","Firma"]
[1]
[2]
[3]
[4]
[5]
[6]
[7]
[8]
[9]
[10]
[11]
[12]
[13]
[14]
[15]
{"$rows_left_out":1}
{"sheet":"AUTORIZACIÓN PASAJES AÉREOS","index":9,"n_rows":51,"n_cols":13,"rows_kept":51,"cut":false,"hidden":false,"merged":[[14,3,14,14],[16,13,16,14],[3,6,3,14],[5,6,5,14],[12,9,12,14],[16,4,16,5],[18,3,18,14],[21,2,21,14],[10,2,10,14],[43,9,43,14],[44,9,44,14],[23,5,23,6],[23,7,23,14],[25,9,25,11],[26,9,26,11],[43,2,43,7],[44,2,44,7],[29,2,29,14],[31,2,36,14],[16,8,16,9],[20,7,20,9],[13,7,13,14],[48,2,48,5],[48,9,48,11],[50,2,51,14],[45,9,45,14],[45,2,46,7]]}
[]
[]
[]
[null,null,null,null,null,null,"SECRETARÍA DE INNOVACIÓN, CIENCIA Y EDUCACIÓN SUPERIOR"]
[]
[null,null,null,null,null,null,"AUTORIZACIÓN DE PASAJES AÉREOS"]
[]
[]
[]
[]
[null,null,"DATOS DE LA SOLICITUD"]
[]
[null,null,"Solicito a usted que se autorice el pago de pasaje aéreo del (la) C.: ",null,null,null,null,null,null," "]
[null,null,"Nombre del evento, comisión o programa:"]
[null,null,"Lugar"]
[]
[null,null,"Fecha de Vuelo",null,null,null,null,"Fecha del Evento",null,null,null,null,"Horario de Evento"]
[]
[null,null,"Cargo "," "]
[]
{"$rows_left_out":32}
{"sheet":"SOLICITUD DE PAGO","index":10,"n_rows":68,"n_cols":12,"rows_kept":68,"cut":false,"hidden":false,"merged":[[27,9,27,10],[28,9,28,10],[29,9,29,10],[30,9,30,10],[31,9,31,10],[22,9,22,10],[23,9,23,10],[24,9,24,10],[25,9,25,10],[26,9,26,10],[32,9,32,11],[37,9,37,11],[34,9,34,11],[35,9,35,11],[36,9,36,11],[12,3,12,4],[12,7,12,10],[13,3,13,4],[13,7,13,11],[19,4,19,11],[17,10,17,11],[15,10,15,11],[16,10,16,11],[15,6,15,7],[8,2,8,11],[10,3,10,11],[1,7,1,11],[2,7,2,11],[4,10,4,11],[5,2,5,6],[6,2,6,6],[22,2,22,5],[20,4,20,11],[63,9,66,11],[62,9,62,11],[45,10,45,11],[48,10,48,11],[41,10,42,11],[46,10,46,11],[47,10,47,11],[59,10,59,11],[56,10,56,11],[57,10,57,11],[58,10,58,11],[44,10,44,11],[43,10,43,11],[62,2,62,5],[65,2,65,5],[66,2,66,5],[32,2,32,4],[34,2,34,4],[37,2,37,4],[35,2,35,4],[36,2,36,4],[41,8,42,8],[41,9,42,9],[39,2,39,11],[40,2,40,11],[41,3,42,3],[41,4,42,4],[41,2,42,2],[41,5,42,5],[41,6,42,6],[41,7,42,7]]}
[]
[null,null,null,null,null,null,null,"DIRECCION GENERAL ADMINISTRATIVA"]
[null,null,null,null,null,null,null,"CERTIFICACIÓN Y SOLICITUD DE PAGO"]
[]
[null,null,null,null,null,null,null,null,null,"FECHA:","16 de diciembre 2019"]
[null,null," COORDINACIÓN GENERAL DE RECURSOS FINANCIEROS"]
[null,null,"P   R   E   S   E   N   T   E."]
[]
[null,null,"Por este medio certifico que recibí de conformidad los bienes y/o servicios enlistados en la presente, por lo cual solicito el pago, asimismo indico que el soporte documental original queda bajo resguardo de esta unidad responsable:"]
[]
[null,null,"A favor de: ","TRANSPORTES TURÍSTICOS DEL BAJIO SA"]
[]
[null,null,"Cantidad:",{"$f":"J61","v":26000},null,null,"(",{"$f":"NUM_TEXTO(D13)","v":"VEINTISEIS MIL PESOS 00/100 M.N."},null,null,null,")"]
[null,null,null,"CON NÚMERO",null,null,null," CON LETRA"]
[]
[null,null,"Forma de pago:",null,null,null,"TRANSFERENCIA BANCARIA",null,null,"BANCO:","Banco Mercantil del Norte"]
[null,null,null,null,null,null,null,null,null,"CUENTA:"]
[null,null,null,null,null,null,null,null,null,"CLABE","072225002520401628"]
[]
[null,null,"Por concepto de :",null,"Creación de pasivos 2019: Arrendamiento de transporte para el traslado de alumnos y docentes del CESEE a la ciudad de"]
{"$rows_left_out":49}
{"sheet":"PT OFICINAS CENTRALES","index":11,"n_rows":74,"n_cols":12,"rows_kept":74,"cut":false,"hidden":false,"merged":[[16,6,16,7],[18,1,18,10],[9,3,9,8],[13,8,15,8],[15,3,15,5],[15,6,15,7],[14,3,14,7],[13,3,13,7],[70,1,70,5],[68,1,68,10],[70,6,72,10],[56,7,56,9],[55,7,55,9],[5,3,5,10],[6,3,7,10],[8,3,8,8],[57,7,57,9],[60,1,61,1],[60,6,60,10],[21,6,21,10],[19,1,19,10],[12,3,12,10],[11,3,11,10],[53,7,53,9],[22,6,52,10],[13,9,15,10],[16,3,16,5],[16,9,16,10],[54,7,54,9]]}
[]
[]
[null,null,null,null,null,null,null,87000]
[]
[]
[null,null,null,"GOBIERNO DEL ESTADO DE GUANAJUATO"]
[null,null,null,"FORMATO DE PAGO A TERCERO"]
[]
[null,null,null," Relación de   1    documentos que amparan un total de: ",null,null,null,null,null,{"$f":"F61","v":0}]
[null,null,null,"            que se envían para su revisión y trámite de pago."]
[]
[null,null,null,"RAMO O ENTIDAD REMITENTE"]
[null,null,null,"09 SECRETARIA DE INNOVACIÓN, CIENCIA Y EDUCACIÓN SUPERIOR"]
[null,null,null,"PROYECTO",null,null,null,null,"FECHA","FOLIO No."]
[]
[null,null,null,"Area Funcional",null,null,"U.R."]
[null,null,null,null,null,null,null,null,null,"09/XXXX"]
[]
[null,"DATOS PROPORCIONADOS POR LA DEPENDENCIA"]
[null,"REFERENCIA AL DOCUMENTO"]
{"$rows_left_out":55}
{"sheet":"PT FORMADORAS","index":12,"n_rows":74,"n_cols":12,"rows_kept":74,"cut":false,"hidden":false,"merged":[[60,6,60,10],[68,1,68,10],[70,1,70,5],[70,6,72,10],[60,1,60,2],[57,7,57,9],[16,3,16,5],[16,6,16,7],[16,9,16,10],[18,1,18,10],[19,1,19,10],[21,6,21,10],[22,6,52,10],[53,7,53,9],[54,7,54,9],[55,7,55,9],[56,7,56,9],[13,3,13,7],[13,8,15,8],[13,9,15,10],[14,3,14,7],[15,3,15,5],[15,6,15,7],[12,3,12,10],[5,3,5,10],[6,3,7,10],[8,3,8,8],[9,3,9,8],[11,3,11,10]]}
[]
[]
[null,null,null,null,null,null,null,87000]
[]
[]
[null,null,null,"GOBIERNO DEL ESTADO DE GUANAJUATO"]
[null,null,null,"FORMATO DE PAGO A TERCERO"]
[]
[null,null,null," Relación de   1    documentos que amparan un total de: ",null,null,null,null,null,{"$f":"F61","v":1108.96}]
[null,null,null,"            que se envían para su revisión y trámite de pago."]
[]
[null,null,null,"RAMO O ENTIDAD REMITENTE"]
[null,null,null,"09 SECRETARIA DE INNOVACIÓN, CIENCIA Y EDUCACIÓN SUPERIOR"]
[null,null,null,"PROYECTO",null,null,null,null,"FECHA","FOLIO No."]
[null,null,null,"P2401"]
[null,null,null,"Area Funcional",null,null,"U.R."]
[null,null,null,"02.05.03",null,null,"0908",null,"2020-01-28","155/0908"]
[]
[null,"DATOS PROPORCIONADOS POR LA DEPENDENCIA"]
[null,"REFERENCIA AL DOCUMENTO"]
{"$rows_left_out":55}
{"sheet":"GO OF CENTRALES","index":13,"n_rows":51,"n_cols":8,"rows_kept":51,"cut":false,"hidden":false,"merged":[[44,1,44,3],[44,5,44,7],[31,5,32,5],[31,6,32,7],[34,1,34,3],[34,5,34,7],[35,1,36,3],[35,5,35,7],[39,1,39,3],[39,5,39,7],[41,1,41,7],[43,1,43,3],[43,5,43,7],[13,1,13,2],[13,4,13,5],[16,1,16,7],[17,1,17,7],[19,6,19,7],[20,6,24,7],[1,3,1,7],[2,3,2,7],[3,3,3,7],[6,4,6,6],[8,3,8,7],[9,1,12,2],[9,3,10,3],[9,4,10,7],[11,4,11,7],[12,4,12,5]]}
[]
[]
[null,null,null,"GOBIERNO DEL ESTADO DE GUANAJUATO"]
[null,null,null,"RELACIÓN DE DOCUMENTOS PARA PAGO"]
[]
[null,null,null,"Relación de XX documentos  que amparan  un importe total de"]
[null,null,null,{"$f":"F32","v":0},"que se envían para su revisión y trámite de pago."]
[null,"GASTO DE OPERACIÓN"]
[null,null,null,"RAMO O ENTIDAD REMITENTE"]
[null,"PAGUESE A :   SECRETARÍA DE INNOVACIÓN, CIENCIA Y EDUCACIÓN SUPERIOR",null,"09","SECRETARÍA DE INNOVACIÓN, CIENCIA Y EDUCACIÓN SUPERIOR"]
[]
[null,null,null,"0906",{"$f":"VLOOKUP(D12,Hoja2!A2:B19,2,FALSE)","v":"ESCUELA NORMAL OFICIAL DE IRAPUATO"}]
[null,null,null,"PROCESO Y SUBPROCESO","ÁREA FUNCIONAL",null,"FECHA","FOLIO No."]
[null,null,null,"PXXXX","XX.XX.XX",null,"1900-01-01","GO 09/XXXX"]
[]
[]
[null,"DATOS PROPORCIONADOS  POR LA DEPENDENCIA"]
[null,"REFERENCIA AL DOCUMENTO"]
[]
[null,"COMPROBANTE NO.","NO. DE ID.","PARTIDA","PÓLIZA","IMPORTE","OBSERVACIONES"]
{"$rows_left_out":32}
{"sheet":"GO FORMADORAS","index":14,"n_rows":51,"n_cols":8,"rows_kept":51,"cut":false,"hidden":false,"merged":[[41,1,41,7],[43,1,43,3],[43,5,43,7],[44,1,44,3],[44,5,44,7],[39,1,39,3],[39,5,39,7],[31,5,32,5],[31,6,32,7],[13,1,13,2],[13,4,13,5],[16,1,16,7],[17,1,17,7],[19,6,19,7],[20,6,24,7],[31,1,33,2],[34,1,34,3],[34,5,34,7],[35,1,36,3],[35,5,35,7],[1,3,1,7],[2,3,2,7],[3,3,3,7],[6,4,6,6],[8,3,8,7],[9,1,12,2],[9,3,10,3],[9,4,10,7],[11,4,11,7],[12,4,12,5]]}
[]
[]
[null,null,null,"GOBIERNO DEL ESTADO DE GUANAJUATO"]
[null,null,null,"RELACIÓN DE DOCUMENTOS PARA PAGO"]
[]
[null,null,null,"Relación de XX documentos  que amparan  un importe total de"]
[null,null,null,{"$f":"F32","v":0},"que se envían para su revisión y trámite de pago."]
[null,"GASTO DE OPERACIÓN"]
[null,null,null,"RAMO O ENTIDAD REMITENTE"]
[null,"PAGUESE A :   SECRETARÍA DE INNOVACIÓN, CIENCIA Y EDUCACIÓN SUPERIOR",null,"09","SECRETARÍA DE INNOVACIÓN, CIENCIA Y EDUCACIÓN SUPERIOR"]
[]
[null,null,null,"0906",{"$f":"VLOOKUP(D12,Hoja2!A2:B19,2,FALSE)","v":"ESCUELA NORMAL OFICIAL DE IRAPUATO"}]
[null,null,null,"PROCESO Y SUBPROCESO","ÁREA FUNCIONAL",null,"FECHA","FOLIO"]
[null,null,null,"PXXXX","XX.XX.XX",null,"1900-01-01","GO 09/XXXX"]
[]
[]
[null,"DATOS PROPORCIONADOS  POR LA DEPENDENCIA"]
[null,"REFERENCIA AL DOCUMENTO"]
[]
[null,"COMPROBANTE NO.","NO. DE ID.","PARTIDA","PÓLIZA","IMPORTE","OBSERVACIONES"]
{"$rows_left_out":32}
{"sheet":"Hoja3","index":15,"n_rows":31,"n_cols":3,"rows_kept":31,"cut":false,"hidden":true,"merged":[]}
["0901","G2120","03.08.04"]
["0902","G2121","02.05.03"]
["0903","G2122","03.08.04"]
["0904","G1161","03.08.04"]
["0905","P2392","02.05.03"]
["0905","P2394","02.05.03"]
["0905","P2395","02.05.03"]
["0905","P2396","02.05.03"]
["0906","P2399","02.05.03"]
["0907","P2400","02.05.03"]
["0908","P2401","02.05.03"]
["0909","P2402","02.05.03"]
["0910","P2403","02.05.03"]
["0911","P2404","02.05.03"]
["0912","P2405","02.05.03"]
["0913","P2406","02.05.03"]
["0914","P2397","02.05.03"]
["0914","Q2230","02.05.03"]
["0914","Q2239","02.05.03"]
["0914","Q3058","02.05.03"]
{"$rows_left_out":12}
{"sheet":"Hoja2","index":16,"n_rows":19,"n_cols":4,"rows_kept":19,"cut":false,"hidden":true,"merged":[]}
["Selecciona…"," ","TITULAR","PUESTO"]
["0901","DESPACHO DEL SECRETARIO","LIC. CARMEN DEL ROSIO ESPARZA VALENCIA","SECRETARIA PARTICULAR DEL SECRETARIO DE INNOVACIÓN, CIENCIA Y EDUCACIÓN SUPERIOR"]
["0902","SUBSECRETARÍA DE EDUCACIÓN SUPERIOR","MTRO. JOSÉ ABEL ARTEAGA SÁNCHEZ","SUBSECRETARIO DE EDUCACIÓN SUPERIOR"]
["0903","SUBSECRETARÍA DE FOMENTO A LA INNOVACIÓN, CIENCIA Y TECNOLOGÍA","MTRO. IGNACIO LÓPEZ VALDOVINOS","SUBSECRETARIO DE FOMENTO A LA INNOVACIÓN CIENCIA Y TECNOLOGÍA"]
["0904","DIRECCIÓN GENERAL ADMINISTRATIVA","C.P. HILDA ORTIZ CARRILLO","DIRECTORA GENERAL DE ADMINISTRACIÓN"]
["0905","DIRECCIÓN GENERAL PARA LA COORDINACIÓN DE ORGANIZACIONES E INSTITUCIONES DE EDUCACIÓN SUPERIOR","LCDA. KARLA SOFÍA PADILLA LEDESMA","DIRECTORA GENERAL PARA LA COORDINACIÓN DE INSTITUCIONES Y ORGANIZACIONES DE EDUCACIÓN SUPERIOR"]
["0906","ESCUELA NORMAL OFICIAL DE IRAPUATO","MTRO. LEONARDO JULIO MENDIOLA MARTÍNEZ","DIRECTOR DE LA ESCUELA NORMAL OFICIAL DE IRAPUATO"]
["0907","ESCUELA NORMAL OFICIAL DE LEÓN","DRA. ALMA VERÓNICA TAVARES VIRAMONTES","DIRECTORA DE LA ESCUELA NORMAL OFICIAL DE LEÓN"]
["0908","ESCUELA NORMAL SUPERIOR OFICIAL DE GUANAJUATO","MTRO. TIBURCIO LÓPEZ MACÍAS","DIRECTOR DE LA ESCUELA NORMAL OFICIAL DE GUANAJUATO"]
["0909","CENTRO DE ESTUDIOS SUPERIORES DE EDUCACIÓN ESPECIALIZADA","MTRA. MA. DE LA LUZ MACÍAS GARCÍA","ENCARGADA DE LA DIRECCIÓN DEL CENTRO DE ESTUDIOS SUPERIORES DE EDUCACIÓN ESPECIALIZADA"]
["0910","BENEMÉRITA Y CENTENARIA ESCUELA NORMAL OFICIAL DE GUANAJUATO","MTRA. MARTHA FABIOLA CARRILLO PÉREZ","DIRECTORA DE LA BENEMÉRITA Y CENTENARIA ESCUELA NORMAL OFICIAL DE GUANAJUATO"]
["0911","UNIVERSIDAD PEDAGÓGICA NACIONAL UNIDAD 112","MTRO. GREGORY J.J.G. BERNIMONT","DIRECTOR DE LA UNIVERSIDAD PEDAGÓGICA NACIONAL UNIDAD 112"]
["0912","UNIVERSIDAD PEDAGÓGICA NACIONAL UNIDAD 113","MTRO. MARIO TAPIA ALBA","ENCARGADO DE LA DIRECCIÓN DE LA UNIVERSIDAD PEDAGÓGICA NACIONAL UNIDAD 113"]
["0913","UNIVERSIDAD PEDAGÓGICA NACIONAL UNIDAD 111","MTRA. MA DE LOS ÁNGELES FREYRE RIZO","DIRECTORA DE LA UNIVERSIDAD PEDAGÓGICA NACIONAL UNIDAD 111"]
["0914","DIRECCIÓN GENERAL PARA  COBERTURA, PERTINENCIA Y CALIDAD DE LA EDUCACIÓN SUPERIOR","MTRO. EDUARDO PÉREZ GUTIÉRREZ","DIRECTOR GENERAL PARA LA PERTINENCIA Y CALIDAD DE LA EDUCACIÓN SUPERIOR"]
["0915","DIRECCIÓN GENERAL DE FOMENTO AL DESARROLLO CIENTÍFICO Y TECNOLÓGICO","ING. JUAN MOISÉS CASTRO ÁLVAREZ","DIRECTOR GENERAL DE FOMENTO AL DESARROLLO CIENTÍFICO Y TECNOLÓGICO"]
["0916","DIRECCIÓN GENERAL DE FOMENTO A LA ECONOMÍA DEL CONOCIMIENTO","LIC. VERÓNICA OROZCO GUTIÉRREZ","DIRECTORA GENERAL DE FOMENTO A LA ECONOMÍA DEL CONOCIMIENTO"]
["0917","DIRECCIÓN GENERAL DE DIVULGACIÓN Y FORMACIÓN CIENTÍFICA Y TECNOLÓGICA","MTRO. IGNACIO LÓPEZ VALDOVINOS","SUBSECRETARIO DE FOMENTO A LA INNOVACIÓN CIENCIA Y TECNOLOGÍA"]
["0918","ÓRGANO INTERNO DE CONTROL","LIC. TERESA ADRIANA DONATO GARNICA","TITULAR DEL ÓRGANO INTERNO DE CONTROL"]